Target
Cytochrome P450 2D3
Ligand
BDBM50122613
Substrate
Meas. Tech.
ChEMBL_51711 (CHEMBL665726)
IC50
1754000±n/a nM
Citation
 Venhorst, Jter Laak, AMCommandeur, JNFunae, YHiroi, TVermeulen, NP Homology modeling of rat and human cytochrome P450 2D (CYP2D) isoforms and computational rationalization of experimental ligand-binding specificities. J Med Chem 46:74-86 (2002)  
Target
Name:
Cytochrome P450 2D3
Synonyms:
CP2D3_RAT Cyp2d3
Type:
PROTEIN
Mol. Mass.:
56643.68
Organism:
Rattus norvegicus
Description:
ChEMBL_51711
Residue:
500
  
Inhibitor
Name:
BDBM50122613
Synonyms:
3,4-dihydroisoquinoline-2(1H)-carboximidamide Debrisochinum Isocaramidine
Type:
Small organic molecule
Emp. Form.:
C10H13N3
Mol. Mass.:
175.2303
SMILES:
NC(=N)N1CCc2ccccc2C1
: