Target
Cytochrome P450 2D6
Ligand
BDBM50122613
Substrate
Meas. Tech.
ChEMBL_51716 (CHEMBL663531)
IC50
23800±n/a nM
Citation
 Venhorst, Jter Laak, AMCommandeur, JNFunae, YHiroi, TVermeulen, NP Homology modeling of rat and human cytochrome P450 2D (CYP2D) isoforms and computational rationalization of experimental ligand-binding specificities. J Med Chem 46:74-86 (2002)  
Target
Name:
Cytochrome P450 2D6
Synonyms:
CP2D6_HUMAN CYP2DL1 Cytochrome P450 2D6 (CYP2D6) P450-DB1
Type:
Protein
Mol. Mass.:
55774.82
Organism:
Homo sapiens (Human)
Description:
P10635
Residue:
497
  
Inhibitor
Name:
BDBM50122613
Synonyms:
3,4-dihydroisoquinoline-2(1H)-carboximidamide Debrisochinum Isocaramidine
Type:
Small organic molecule
Emp. Form.:
C10H13N3
Mol. Mass.:
175.2303
SMILES:
NC(=N)N1CCc2ccccc2C1
: