Target
Sodium-dependent serotonin transporter
Ligand
BDBM50118185
Substrate
Meas. Tech.
ChEMBL_202132 (CHEMBL808121)
Ki
2.6±n/a nM
Citation
 Carroll, FI 2002 Medicinal Chemistry Division Award address: monoamine transporters and opioid receptors. Targets for addiction therapy. J Med Chem 46:1775-94 (2003)  
Target
Name:
Sodium-dependent serotonin transporter
Synonyms:
5-HT Transporter 5HT transporter Anandamid membrane transporter, AMT Monoamine transporters; Norepinephrine & serotonin Slc6a4 Sodium-dependent serotonin transporter (SERT) | imipramine receptor
Type:
Multi-pass membrane protein
Mol. Mass.:
70168.43
Organism:
Rattus norvegicus (rat)
Description:
P31652
Residue:
630
  
Inhibitor
Name:
BDBM50118185
Synonyms:
(3S,8R)-3-(4-Ethyl-phenyl)-8-methyl-8-aza-bicyclo[3.2.1]octane-2-carboxylic acid methyl ester CHEMBL50157
Type:
Small organic molecule
Emp. Form.:
C18H25NO2
Mol. Mass.:
287.3966
SMILES:
CCc1ccc(cc1)[C@H]1C[C@H]2CCC(C1C(=O)OC)N2C
: