Target
Kappa-type opioid receptor
Ligand
BDBM50128074
Substrate
Meas. Tech.
ChEMBL_145252 (CHEMBL751030)
Ki
0.350000±n/a nM
Citation
 Schlechtingen, GDeHaven, RNDaubert, JDCassel, JAChung, NNSchiller, PWTaulane, JPGoodman, M Structure-activity relationships of dynorphin a analogues modified in the address sequence. J Med Chem 46:2104-9 (2003)  
Target
Name:
Kappa-type opioid receptor
Synonyms:
K-OR-1 Kappa-opioid receptor (KOR) Kappa-type opioid receptor (KOR) OPIATE Kappa OPRK1 kappa opioid receptor (KOR)
Type:
G Protein-Coupled Receptor (GPCR)
Mol. Mass.:
42648.76
Organism:
Homo sapiens (Human)
Description:
P41145
Residue:
380
  
Inhibitor
Name:
BDBM50128074
Synonyms:
CHEMBL269483 | Tyr-Gly-Gly-Phe-Leu-Arg-Arg-Ile-Arg-Pro-OH
Type:
Small organic molecule
Emp. Form.:
C57H91N19O12
Mol. Mass.:
1234.4525
SMILES:
CC[C@H](C)[C@H](NC(=O)[C@H](CCCNC(N)=N)NC(=O)[C@H](CCCNC(N)=N)NC(=O)[C@H](CC(C)C)NC(=O)[C@H](Cc1ccccc1)NC(=O)CNC(=O)CNC(=O)[C@@H](N)Cc1ccc(O)cc1)C(=O)N[C@@H](CCCNC(N)=N)C(=O)N1CCC[C@@H]1C(O)=O
: