Target
Matrix metalloproteinase-9
Ligand
BDBM50128634
Substrate
Meas. Tech.
ChEMBL_105516 (CHEMBL715225)
IC50
138±n/a nM
Citation
 Aranapakam, VDavis, JMGrosu, GTBaker, JEllingboe, JZask, ALevin, JISandanayaka, VPDu, MSkotnicki, JSDiJoseph, JFSung, ASharr, MAKillar, LMWalter, TJin, GCowling, RTillett, JZhao, WMcDevitt, JXu, ZB Synthesis and structure-activity relationship of N-substituted 4-arylsulfonylpiperidine-4-hydroxamic acids as novel, orally active matrix metalloproteinase inhibitors for the treatment of osteoarthritis. J Med Chem 46:2376-96 (2003)  
Target
Name:
Matrix metalloproteinase-9
Synonyms:
67 kDa matrix metalloproteinase-9 92 kDa gelatinase CLG4B Gelatinase B MMP9 Matrix metalloproteinase 9 (MMP-9) Matrix metalloproteinase-9 (MMP9)
Type:
Enzyme
Mol. Mass.:
78452.28
Organism:
Homo sapiens (Human)
Description:
P14780
Residue:
707
  
Inhibitor
Name:
BDBM50128634
Synonyms:
1-Cyclooctyl-4-(4-methoxy-benzenesulfonyl)-piperidine-4-carboxylic acid hydroxyamide CHEMBL81763
Type:
Small organic molecule
Emp. Form.:
C21H32N2O5S
Mol. Mass.:
424.554
SMILES:
COc1ccc(cc1)S(=O)(=O)C1(CCN(CC1)C1CCCCCCC1)C(=O)NO
: