Target
Matrix metalloproteinase-9
Ligand
BDBM50131953
Substrate
Meas. Tech.
ChEMBL_105365 (CHEMBL712901)
IC50
3±n/a nM
Citation
 Le Diguarher, TChollet, AMBertrand, MHennig, PRaimbaud, ESabatini, MGuilbaud, NPierré, ATucker, GCCasara, P Stereospecific synthesis of 5-substituted 2-bisarylthiocyclopentane carboxylic acids as specific matrix metalloproteinase inhibitors. J Med Chem 46:3840-52 (2003)  
Target
Name:
Matrix metalloproteinase-9
Synonyms:
67 kDa matrix metalloproteinase-9 92 kDa gelatinase CLG4B Gelatinase B MMP9 Matrix metalloproteinase 9 (MMP-9) Matrix metalloproteinase-9 (MMP9)
Type:
Enzyme
Mol. Mass.:
78452.28
Organism:
Homo sapiens (Human)
Description:
P14780
Residue:
707
  
Inhibitor
Name:
BDBM50131953
Synonyms:
2-(4'-Chloro-biphenyl-4-ylsulfanyl)-5-(4-oxo-4H-benzo[d][1,2,3]triazin-3-ylmethyl)-cyclopentanecarboxylic acid | CHEMBL339588
Type:
Small organic molecule
Emp. Form.:
C26H22ClN3O3S
Mol. Mass.:
491.989
SMILES:
OC(=O)[C@@H]1[C@@H](Cn2nnc3ccccc3c2=O)CC[C@H]1Sc1ccc(cc1)-c1ccc(Cl)cc1
: