Target
Phosphodiesterase
Ligand
BDBM14363
Substrate
Meas. Tech.
ChEMBL_156452 (CHEMBL764830)
IC50
>10000±n/a nM
Citation
 Daugan, AGrondin, PRuault, CLe Monnier de Gouville, ACCoste, HKirilovsky, JHyafil, FLabaudinière, R The discovery of tadalafil: a novel and highly selective PDE5 inhibitor. 1: 5,6,11,11a-tetrahydro-1H-imidazo[1',5':1,6]pyrido[3,4-b]indole-1,3(2H)-dione analogues. J Med Chem 46:4525-32 (2003)  
Target
Name:
Phosphodiesterase
Synonyms:
Heart phosphodiesterase | Phosphodiesterase 3B
Type:
PROTEIN
Mol. Mass.:
124301.20
Organism:
Bos taurus
Description:
ChEMBL_156453
Residue:
1115
  
Inhibitor
Name:
BDBM14363
Synonyms:
3-(2-propoxyphenyl)-2,4,7,8,9-pentazabicyclo[4.3.0]nona-1,3,6-trien-5-one Tocris-0947 | Zaprinast
Type:
Small organic molecule
Emp. Form.:
C13H13N5O2
Mol. Mass.:
271.2746
SMILES:
CCCOc1ccccc1-c1nc2nn[nH]c2c(=O)[nH]1
: