Target
Histone deacetylase 1
Ligand
BDBM50114819
Substrate
Meas. Tech.
ChEMBL_87858 (CHEMBL701996)
IC50
1500±n/a nM
Citation
 Miller, TAWitter, DJBelvedere, S Histone deacetylase inhibitors. J Med Chem 46:5097-116 (2003)  
Target
Name:
Histone deacetylase 1
Synonyms:
Cereblon/Histone deacetylase 1 HDAC1 Histone deacetylase 1 (HDAC1) RPD3L1
Type:
Enzyme
Mol. Mass.:
55090.27
Organism:
Homo sapiens (Human)
Description:
Q13547
Residue:
482
  
Inhibitor
Name:
BDBM50114819
Synonyms:
6-Oxo-6-phenyl-hexanoic acid hydroxyamide N-hydroxy-6-oxo-6-phenylhexanamide
Type:
Small organic molecule
Emp. Form.:
C12H15NO3
Mol. Mass.:
221.2524
SMILES:
ONC(=O)CCCCC(=O)c1ccccc1
: