Target
Mitogen-activated protein kinase 14
Ligand
BDBM50136884
Substrate
Meas. Tech.
ChEMBL_124178 (CHEMBL732094)
IC50
12±n/a nM
Citation
 Ottosen, ERSørensen, MDBjörkling, FSkak-Nielsen, TFjording, MSAaes, HBinderup, L Synthesis and structure-activity relationship of aminobenzophenones. A novel class of p38 MAP kinase inhibitors with high antiinflammatory activity. J Med Chem 46:5651-62 (2003)  
Target
Name:
Mitogen-activated protein kinase 14
Synonyms:
CSAID-binding protein CSBP1 CSPB1 MAP kinase 14 MAP kinase p38 alpha MAPK14 MK14_HUMAN Mitogen-activated protein kinase p38 alpha Stress-activated protein kinase 2a | p38 MAP kinase alpha/beta
Type:
Serine/threonine-protein kinase
Mol. Mass.:
41286.76
Organism:
Homo sapiens (Human)
Description:
Q16539
Residue:
360
  
Inhibitor
Name:
BDBM50136884
Synonyms:
(2-Chloro-4-o-tolylamino-phenyl)-o-tolyl-methanone | CHEMBL153265
Type:
Small organic molecule
Emp. Form.:
C21H18ClNO
Mol. Mass.:
335.827
SMILES:
Cc1ccccc1Nc1ccc(C(=O)c2ccccc2C)c(Cl)c1
: