Target
Serine/threonine-protein kinase N1
Ligand
BDBM14027
Substrate
Meas. Tech.
ChEMBL_161438 (CHEMBL772572)
IC50
1700±n/a nM
Citation
 McGovern, SLShoichet, BK Kinase inhibitors: not just for kinases anymore. J Med Chem 46:1478-83 (2003)  
Target
Name:
Serine/threonine-protein kinase N1
Synonyms:
PAK1 PKN1 PRK1 Protein kinase N1 | Serine/threonine-protein kinase N1/Transforming protein RhoA
Type:
PROTEIN
Mol. Mass.:
103928.39
Organism:
Homo sapiens (Human)
Description:
ChEMBL_1433150
Residue:
942
  
Inhibitor
Name:
BDBM14027
Synonyms:
5-(1,4-diazepan-1-ylsulfonyl)isoquinoline AT877 CHEMBL541388 HA-1077 cid_163751
Type:
Small organic molecule
Emp. Form.:
C14H17N3O2S
Mol. Mass.:
291.369
SMILES:
O=S(=O)(N1CCCNCC1)c1cccc2cnccc12
: