Target
Adenosine receptor A1
Ligand
BDBM50150078
Substrate
Meas. Tech.
ChEMBL_27574 (CHEMBL643496)
Ki
4.4±n/a nM
Citation
 Beukers, MWChang, LCvon Frijtag Drabbe Künzel, JKMulder-Krieger, TSpanjersberg, RFBrussee, JIJzerman, AP New, non-adenosine, high-potency agonists for the human adenosine A2B receptor with an improved selectivity profile compared to the reference agonist N-ethylcarboxamidoadenosine. J Med Chem 47:3707-9 (2004)  
Target
Name:
Adenosine receptor A1
Synonyms:
A1 adenosine receptor (hA1) AA1R_HUMAN ADORA1 Adenosine A1-receptor Adenosine receptor A1 (hA1) | Adenosine transporter (AdT)
Type:
G Protein-Coupled Receptor (GPCR)
Mol. Mass.:
36520.92
Organism:
Homo sapiens (Human)
Description:
P30542
Residue:
326
  
Inhibitor
Name:
BDBM50150078
Synonyms:
2-Amino-4-(3-hydroxy-phenyl)-6-(1H-imidazol-2-ylmethylsulfanyl)-pyridine-3,5-dicarbonitrile | CHEMBL122806
Type:
Small organic molecule
Emp. Form.:
C17H12N6OS
Mol. Mass.:
348.382
SMILES:
Nc1nc(SCc2ncc[nH]2)c(C#N)c(-c2cccc(O)c2)c1C#N
: