Target
Motilin receptor
Ligand
BDBM50344942
Substrate
Meas. Tech.
ChEMBL_122662 (CHEMBL732792)
Ki
37000±n/a nM
Citation
 Li, JJChao, HGWang, HTino, JALawrence, RMEwing, WRMa, ZYan, MSlusarchyk, DSeethala, RSun, HLi, DBurford, NTStoffel, RHSalyan, MELi, CYWitkus, MZhao, NRich, AGordon, DA Discovery of a potent and novel motilin agonist. J Med Chem 47:1704-8 (2004)  
Target
Name:
Motilin receptor
Synonyms:
G-protein coupled receptor 38 MLNR MTLR1 | MTLR_HUMAN
Type:
PROTEIN
Mol. Mass.:
45365.95
Organism:
Homo sapiens (Human)
Description:
ChEMBL_122664
Residue:
412
  
Inhibitor
Name:
BDBM50344942
Synonyms:
CHEMBL532 ERYTHROMYCIN Erycette Erythromycin A Ilotycin | T-Stat
Type:
Small organic molecule
Emp. Form.:
C37H67NO13
Mol. Mass.:
733.9268
SMILES:
CC[C@H]1OC(=O)[C@H](C)[C@@H](O[C@H]2C[C@@](C)(OC)[C@@H](O)[C@H](C)O2)[C@H](C)[C@@H](O[C@@H]2O[C@H](C)C[C@@H]([C@H]2O)N(C)C)[C@](C)(O)C[C@@H](C)C(=O)[C@H](C)[C@@H](O)[C@]1(C)O
: