Target
Coagulation factor X
Ligand
BDBM50150488
Substrate
Meas. Tech.
ChEMBL_305554 (CHEMBL828573)
IC50
30±n/a nM
Citation
 Ueno, HKatoh, SYokota, KHoshi, JHayashi, MUchida, IAisaka, KHase, YCho, H Structure-activity relationships of potent and selective factor Xa inhibitors: benzimidazole derivatives with the side chain oriented to the prime site of factor Xa. Bioorg Med Chem Lett 14:4281-6 (2004)  
Target
Name:
Coagulation factor X
Synonyms:
Activated coagulation factor X (FXa) Coagulation factor X precursor F10 Factor X heavy chain Factor Xa Stuart-Prower factor
Type:
Enzyme
Mol. Mass.:
54726.60
Organism:
Homo sapiens (Human)
Description:
Residue:
488
  
Inhibitor
Name:
BDBM50150488
Synonyms:
2-(5-Carbamimidoyl-2-{4-[1-(1-imino-ethyl)-piperidin-4-yloxy]-phenoxymethyl}-benzoimidazol-1-yl)-N-(3,4-dichloro-benzyl)-acetamide; dihydrochloride | CHEMBL541371
Type:
Small organic molecule
Emp. Form.:
C31H33Cl2N7O3
Mol. Mass.:
622.545
SMILES:
CC(=N)N1CCC(CC1)Oc1ccc(OCc2nc3cc(ccc3n2CC(=O)NCc2ccc(Cl)c(Cl)c2)C(N)=N)cc1
: