Target
Carbonic anhydrase 4
Ligand
BDBM26979
Substrate
Meas. Tech.
ChEMBL_302422 (CHEMBL828825)
Ki
36000000±n/a nM
Citation
 Innocenti, AZimmerman, SFerry, JGScozzafava, ASupuran, CT Carbonic anhydrase inhibitors. Inhibition of the beta-class enzyme from the methanoarchaeon Methanobacterium thermoautotrophicum (Cab) with anions. Bioorg Med Chem Lett 14:4563-7 (2004)  
Target
Name:
Carbonic anhydrase 4
Synonyms:
CA-IV CAH4_HUMAN Carbonic anhydrase Carbonic anhydrase IV (CA IV)
Type:
Enzyme
Mol. Mass.:
35037.98
Organism:
Homo sapiens (Human)
Description:
P22748
Residue:
312
  
Inhibitor
Name:
BDBM26979
Synonyms:
CHEMBL69710 POTASSIUM CHLORIDE chloride | chloride ion
Type:
Ion
Emp. Form.:
Cl
Mol. Mass.:
35.454
SMILES:
[Cl-]
: