Target
Melanocyte-stimulating hormone receptor
Ligand
BDBM50167683
Substrate
Meas. Tech.
ChEMBL_302571 (CHEMBL839532)
Ki
>5000±n/a nM
Citation
 Tian, XField, TMazur, AWEbetino, FHWos, JACrossdoersen, DPinney, BBSheldon, RJ Design, synthesis, and evaluation of proline based melanocortin receptor ligands. Bioorg Med Chem Lett 15:2819-23 (2005)  
Target
Name:
Melanocyte-stimulating hormone receptor
Synonyms:
MC1-R MSH-R MSHR_HUMAN Melanocortin receptor (M1 and M4) Melanocortin receptor 1 (MC1-R) | Melanocortin receptor 1 (MC1R)
Type:
Enzyme
Mol. Mass.:
34717.23
Organism:
Homo sapiens (Human)
Description:
Q01726
Residue:
317
  
Inhibitor
Name:
BDBM50167683
Synonyms:
(2S,4S)-4-Benzyl-1-[(S)-5-guanidino-2-(2-naphthalen-2-yl-acetylamino)-pentanoyl]-pyrrolidine-2-carboxylic acid benzylamide | CHEMBL439522
Type:
Small organic molecule
Emp. Form.:
C37H42N6O3
Mol. Mass.:
618.7678
SMILES:
NC(=N)NCCC[C@H](NC(=O)Cc1ccc2ccccc2c1)C(=O)N1C[C@@H](Cc2ccccc2)C[C@H]1C(=O)NCc1ccccc1
: