Target
Kappa-type opioid receptor
Ligand
BDBM50169772
Substrate
Meas. Tech.
ChEMBL_302641 (CHEMBL876690)
Ki
0.400±n/a nM
Citation
 Lee, DYKarnati, VVHe, MLiu-Chen, LYKondaveti, LMa, ZWang, YChen, YBeguin, CCarlezon, WACohen, B Synthesis and in vitro pharmacological studies of new C(2) modified salvinorin A analogues. Bioorg Med Chem Lett 15:3744-7 (2005)  
Target
Name:
Kappa-type opioid receptor
Synonyms:
K-OR-1 Kappa-opioid receptor (KOR) Kappa-type opioid receptor (KOR) OPIATE Kappa OPRK1 kappa opioid receptor (KOR)
Type:
G Protein-Coupled Receptor (GPCR)
Mol. Mass.:
42648.76
Organism:
Homo sapiens (Human)
Description:
P41145
Residue:
380
  
Inhibitor
Name:
BDBM50169772
Synonyms:
(3S,4aR,6S,8R,8aR,10aR)-3-Furan-3-yl-6-methoxymethoxy-4a,8a-dimethyl-1,5-dioxo-dodecahydro-2-oxa-phenanthrene-8-carboxylic acid methyl ester | CHEMBL180126
Type:
Small organic molecule
Emp. Form.:
C23H30O8
Mol. Mass.:
434.4795
SMILES:
COCO[C@H]1C[C@@H](C(=O)OC)[C@]2(C)CC[C@H]3C(=O)O[C@@H](C[C@]3(C)C2C1=O)c1ccoc1
: