Target
Carbonic anhydrase 9
Ligand
BDBM33282
Substrate
Meas. Tech.
ChEMBL_303142 (CHEMBL829116)
Ki
7±n/a nM
Citation
 Winum, JYPastorekova, SJakubickova, LMontero, JLScozzafava, APastorek, JVullo, DInnocenti, ASupuran, CT Carbonic anhydrase inhibitors: synthesis and inhibition of cytosolic/tumor-associated carbonic anhydrase isozymes I, II, and IX with bis-sulfamates. Bioorg Med Chem Lett 15:579-84 (2005)  
Target
Name:
Carbonic anhydrase 9
Synonyms:
CA-IX CAH9_HUMAN Carbonic anhydrase 9 (CA IX) Carbonic anhydrase 9 precursor Carbonic anhydrase IX (CAIX) Carbonic anhydrases; II & IX MN RCC-associated antigen G250
Type:
Enzyme
Mol. Mass.:
49669.03
Organism:
Homo sapiens (Human)
Description:
Catalytic domain of human cloned isozyme was used in the assay
Residue:
459
  
Inhibitor
Name:
BDBM33282
Synonyms:
CHEMBL171476 | bis-sulfamate, 4
Type:
Small organic molecule
Emp. Form.:
C10H24N2O6S2
Mol. Mass.:
332.437
SMILES:
NS(=O)(=O)OCCCCCCCCCCOS(N)(=O)=O
: