Target
Carbonic anhydrase 9
Ligand
BDBM50159804
Substrate
Meas. Tech.
ChEMBL_303142 (CHEMBL829116)
Ki
58±n/a nM
Citation
 Winum, JYPastorekova, SJakubickova, LMontero, JLScozzafava, APastorek, JVullo, DInnocenti, ASupuran, CT Carbonic anhydrase inhibitors: synthesis and inhibition of cytosolic/tumor-associated carbonic anhydrase isozymes I, II, and IX with bis-sulfamates. Bioorg Med Chem Lett 15:579-84 (2005)  
Target
Name:
Carbonic anhydrase 9
Synonyms:
CA-IX CAH9_HUMAN Carbonic anhydrase 9 (CA IX) Carbonic anhydrase 9 precursor Carbonic anhydrase IX (CAIX) Carbonic anhydrases; II & IX MN RCC-associated antigen G250
Type:
Enzyme
Mol. Mass.:
49669.03
Organism:
Homo sapiens (Human)
Description:
Catalytic domain of human cloned isozyme was used in the assay
Residue:
459
  
Inhibitor
Name:
BDBM50159804
Synonyms:
CHEMBL221802 sulfamic acid (8R,9S,13S,14S,17S)-13-methyl-3-sulfamoyloxy-7,8,9,11,12,13,14,15,16,17-decahydro-6H-cyclopenta[a]phenanthren-17-yl ester
Type:
Small organic molecule
Emp. Form.:
C18H26N2O6S2
Mol. Mass.:
430.539
SMILES:
C[C@]12CC[C@H]3[C@@H](CCc4cc(OS(N)(=O)=O)ccc34)[C@@H]1CC[C@@H]2OS(N)(=O)=O
: