Target
Carbonic anhydrase 2
Ligand
BDBM50128219
Substrate
Meas. Tech.
ChEMBL_302729 (CHEMBL838677)
Ki
76.3±n/a nM
Citation
 Winum, JYPastorekova, SJakubickova, LMontero, JLScozzafava, APastorek, JVullo, DInnocenti, ASupuran, CT Carbonic anhydrase inhibitors: synthesis and inhibition of cytosolic/tumor-associated carbonic anhydrase isozymes I, II, and IX with bis-sulfamates. Bioorg Med Chem Lett 15:579-84 (2005)  
Target
Name:
Carbonic anhydrase 2
Synonyms:
CA-II CAC Carbonate dehydratase II Carbonic anhydrase 2 (CA-II) Carbonic anhydrase C Carbonic anhydrase II (CA-II) Carbonic anhydrase II (hCA II) | Carbonic anhydrase isoenzyme II (hCA II)
Type:
Enzyme
Mol. Mass.:
29250.71
Organism:
Homo sapiens (Human)
Description:
P00918
Residue:
260
  
Inhibitor
Name:
BDBM50128219
Synonyms:
CHEMBL68257 | Sulfamic acid 3-pentyl-5-sulfamoyloxy-phenyl ester
Type:
Small organic molecule
Emp. Form.:
C11H18N2O6S2
Mol. Mass.:
338.4
SMILES:
CCCCCc1cc(OS(N)(=O)=O)cc(OS(N)(=O)=O)c1
: