Target
Carbonic anhydrase 2
Ligand
BDBM33282
Substrate
Meas. Tech.
ChEMBL_302729 (CHEMBL838677)
Ki
24.5±n/a nM
Citation
 Winum, JYPastorekova, SJakubickova, LMontero, JLScozzafava, APastorek, JVullo, DInnocenti, ASupuran, CT Carbonic anhydrase inhibitors: synthesis and inhibition of cytosolic/tumor-associated carbonic anhydrase isozymes I, II, and IX with bis-sulfamates. Bioorg Med Chem Lett 15:579-84 (2005)  
Target
Name:
Carbonic anhydrase 2
Synonyms:
CA-II CAC Carbonate dehydratase II Carbonic anhydrase 2 (CA-II) Carbonic anhydrase C Carbonic anhydrase II (CA-II) Carbonic anhydrase II (hCA II) | Carbonic anhydrase isoenzyme II (hCA II)
Type:
Enzyme
Mol. Mass.:
29250.71
Organism:
Homo sapiens (Human)
Description:
P00918
Residue:
260
  
Inhibitor
Name:
BDBM33282
Synonyms:
CHEMBL171476 | bis-sulfamate, 4
Type:
Small organic molecule
Emp. Form.:
C10H24N2O6S2
Mol. Mass.:
332.437
SMILES:
NS(=O)(=O)OCCCCCCCCCCOS(N)(=O)=O
: