Target
Carbonic anhydrase 2
Ligand
BDBM50154471
Substrate
Meas. Tech.
ChEMBL_302729 (CHEMBL838677)
Ki
8±n/a nM
Citation
 Winum, JYPastorekova, SJakubickova, LMontero, JLScozzafava, APastorek, JVullo, DInnocenti, ASupuran, CT Carbonic anhydrase inhibitors: synthesis and inhibition of cytosolic/tumor-associated carbonic anhydrase isozymes I, II, and IX with bis-sulfamates. Bioorg Med Chem Lett 15:579-84 (2005)  
Target
Name:
Carbonic anhydrase 2
Synonyms:
CA-II CAC Carbonate dehydratase II Carbonic anhydrase 2 (CA-II) Carbonic anhydrase C Carbonic anhydrase II (CA-II) Carbonic anhydrase II (hCA II) | Carbonic anhydrase isoenzyme II (hCA II)
Type:
Enzyme
Mol. Mass.:
29250.71
Organism:
Homo sapiens (Human)
Description:
P00918
Residue:
260
  
Inhibitor
Name:
BDBM50154471
Synonyms:
CHEMBL182440 | Sulfamic acid 7-sulfamoyloxy-heptyl ester
Type:
Small organic molecule
Emp. Form.:
C7H18N2O6S2
Mol. Mass.:
290.358
SMILES:
NS(=O)(=O)OCCCCCCCOS(N)(=O)=O
: