Target
Melanin-concentrating hormone receptor 1
Ligand
BDBM50160723
Substrate
Meas. Tech.
ChEMBL_303805 (CHEMBL829854)
Ki
7.3±n/a nM
Citation
 Grey, JDyck, BRowbottom, MWTamiya, JVickers, TDZhang, MZhao, LHeise, CESchwarz, DSaunders, JGoodfellow, VS Bis(aminopyrrolidine)-derived ureas (APUs) as potent MCH1 receptor antagonists. Bioorg Med Chem Lett 15:999-1004 (2005)  
Target
Name:
Melanin-concentrating hormone receptor 1
Synonyms:
G-protein coupled receptor 24 MCH receptor 1 MCH-R1 MCHR-1 MCHR1_HUMAN Melanin-Concentrating Hormone Receptor 1 (MCH1R) Melanin-concentrating hormone receptor 1 (MCH-1) Melanin-concentrating hormone receptor 1 (MCHR-1) SLC-1 Somatostatin receptor-like protein
Type:
G Protein-Coupled Receptor (GPCR)
Mol. Mass.:
45976.27
Organism:
Homo sapiens (Human)
Description:
Membranes from CHO-K1 cells stably expressing human MCH1R were used in assays.
Residue:
422
  
Inhibitor
Name:
BDBM50160723
Synonyms:
3-[Methyl-(4''-trifluoromethyl-biphenyl-4-carbonyl)-amino]-pyrrolidine-1-carboxylic acid {1-[3-(4-chloro-phenyl)-propyl]-pyrrolidin-3-yl}-methyl-amide | CHEMBL360976
Type:
Small organic molecule
Emp. Form.:
C34H38ClF3N4O2
Mol. Mass.:
627.139
SMILES:
CN(C1CCN(CCCc2ccc(Cl)cc2)C1)C(=O)N1CCC(C1)N(C)C(=O)c1ccc(cc1)-c1ccc(cc1)C(F)(F)F
: