Target
Adenosine deaminase
Ligand
BDBM50171389
Substrate
Meas. Tech.
ChEMBL_302877 (CHEMBL828791)
Ki
4619±n/a nM
Citation
 Da Settimo, FPrimofiore, GLa Motta, CTaliani, SSimorini, FMarini, AMMugnaini, LLavecchia, ANovellino, ETuscano, DMartini, C Novel, highly potent adenosine deaminase inhibitors containing the pyrazolo[3,4-d]pyrimidine ring system. Synthesis, structure-activity relationships, and molecular modeling studies. J Med Chem 48:5162-74 (2005)  
Target
Name:
Adenosine deaminase
Synonyms:
ADA Adenosine aminohydrolase
Type:
Enzyme
Mol. Mass.:
40910.44
Organism:
Bos taurus (bovine)
Description:
Residue:
363
  
Inhibitor
Name:
BDBM50171389
Synonyms:
2-(4-Amino-3a,7a-dihydro-pyrazolo[3,4-d]pyrimidin-1-yl)-ethanol | CHEMBL192799
Type:
Small organic molecule
Emp. Form.:
C7H11N5O
Mol. Mass.:
181.1951
SMILES:
NC1=NC=NC2C1C=NN2CCO
: