Target
Thymidine phosphorylase
Ligand
BDBM50159221
Substrate
Meas. Tech.
ChEMBL_305483 (CHEMBL830274)
IC50
101400±n/a nM
Citation
 Reigan, PEdwards, PNGbaj, ACole, CBarry, STPage, KMAshton, SELuke, RWDouglas, KTStratford, IJJaffar, MBryce, RAFreeman, S Aminoimidazolylmethyluracil analogues as potent inhibitors of thymidine phosphorylase and their bioreductive nitroimidazolyl prodrugs. J Med Chem 48:392-402 (2005)  
Target
Name:
Thymidine phosphorylase
Synonyms:
TYPH_ECOLI Thymidine Phosphorylase (TP) tpp | ttg
Type:
Enzyme
Mol. Mass.:
47198.54
Organism:
Escherichia coli
Description:
Residue:
440
  
Inhibitor
Name:
BDBM50159221
Synonyms:
4-Amino-1-(2,6-dioxo-1,2,3,6-tetrahydro-pyrimidin-4-ylmethyl)-3H-imidazol-1-ium | CHEMBL370275
Type:
Small organic molecule
Emp. Form.:
C8H10N5O2
Mol. Mass.:
208.1968
SMILES:
Nc1c[n+](Cc2cc(=O)[nH]c(=O)[nH]2)c[nH]1
: