Target
Adenosine receptor A1
Ligand
BDBM50163414
Substrate
Meas. Tech.
ChEMBL_303304 (CHEMBL840030)
Ki
>250±n/a nM
Citation
 Vu, CBPan, DPeng, BKumaravel, GSmits, GJin, XPhadke, DEngber, THuang, CReilly, JTam, SGrant, DHetu, GPetter, RC Novel diamino derivatives of [1,2,4]triazolo[1,5-a][1,3,5]triazine as potent and selective adenosine A2a receptor antagonists. J Med Chem 48:2009-18 (2005)  
Target
Name:
Adenosine receptor A1
Synonyms:
AA1R_RAT ADENOSINE A1 high Adenosine A1 receptor (A1) Adenosine receptors A1 | Adora1
Type:
Protein
Mol. Mass.:
36704.13
Organism:
Rattus norvegicus (rat)
Description:
Residue:
326
  
Inhibitor
Name:
BDBM50163414
Synonyms:
CHEMBL368620 | N*5*-[(R)-1-(3,5-Difluoro-benzyl)-pyrrolidin-2-ylmethyl]-2-furan-2-yl-[1,2,4]triazolo[1,5-a][1,3,5]triazine-5,7-diamine
Type:
Small organic molecule
Emp. Form.:
C20H20F2N8O
Mol. Mass.:
426.4226
SMILES:
Nc1nc(NC[C@H]2CCCN2Cc2cc(F)cc(F)c2)nc2nc(nn12)-c1ccco1
: