Target
Adenosine receptor A1
Ligand
BDBM50163448
Substrate
Meas. Tech.
ChEMBL_302941 (CHEMBL841776)
Ki
4.3±n/a nM
Citation
 Chang, LCvon Frijtag Drabbe Künzel, JKMulder-Krieger, TSpanjersberg, RFRoerink, SFvan den Hout, GBeukers, MWBrussee, JIjzerman, AP A series of ligands displaying a remarkable agonistic-antagonistic profile at the adenosine A1 receptor. J Med Chem 48:2045-53 (2005)  
Target
Name:
Adenosine receptor A1
Synonyms:
A1 adenosine receptor (hA1) AA1R_HUMAN ADORA1 Adenosine A1-receptor Adenosine receptor A1 (hA1) | Adenosine transporter (AdT)
Type:
G Protein-Coupled Receptor (GPCR)
Mol. Mass.:
36520.92
Organism:
Homo sapiens (Human)
Description:
P30542
Residue:
326
  
Inhibitor
Name:
BDBM50163448
Synonyms:
2-Amino-6-(2-hydroxy-ethylsulfanyl)-4-(3-methoxy-phenyl)-pyridine-3,5-dicarbonitrile | CHEMBL176254
Type:
Small organic molecule
Emp. Form.:
C16H14N4O2S
Mol. Mass.:
326.373
SMILES:
COc1cccc(c1)-c1c(C#N)c(N)nc(SCCO)c1C#N
: