Target
Metabotropic glutamate receptor 1
Ligand
BDBM50163605
Substrate
Meas. Tech.
ChEMBL_305830 (CHEMBL829572)
IC50
85±n/a nM
Citation
 Mabire, DCoupa, SAdelinet, CPoncelet, ASimonnet, YVenet, MWouters, RLesage, ASVan Beijsterveldt, LBischoff, F Synthesis, structure-activity relationship, and receptor pharmacology of a new series of quinoline derivatives acting as selective, noncompetitive mGlu1 antagonists. J Med Chem 48:2134-53 (2005)  
Target
Name:
Metabotropic glutamate receptor 1
Synonyms:
GRM1_RAT Grm1 Metabotropic glutamate receptor Mglur1 metabotropic glutamate 1/5-D metabotropic glutamate receptor 1 isoform alpha precursor
Type:
Enzyme Catalytic Domain
Mol. Mass.:
133240.47
Organism:
RAT
Description:
metabotropic glutamate 1/2 0 RAT::P23385
Residue:
1199
  
Inhibitor
Name:
BDBM50163605
Synonyms:
3-Cyclohexa-1,5-dienyl-1-(3,4-dihydro-2H-1-oxa-9-aza-anthracen-6-yl)-propan-1-one | CHEMBL353547
Type:
Small organic molecule
Emp. Form.:
C21H19NO2
Mol. Mass.:
317.3811
SMILES:
O=C(CCc1ccccc1)c1ccc2nc3OCCCc3cc2c1
: