Target
Metabotropic glutamate receptor 1
Ligand
BDBM50163600
Substrate
Meas. Tech.
ChEMBL_305883 (CHEMBL874546)
IC50
80±n/a nM
Citation
 Mabire, DCoupa, SAdelinet, CPoncelet, ASimonnet, YVenet, MWouters, RLesage, ASVan Beijsterveldt, LBischoff, F Synthesis, structure-activity relationship, and receptor pharmacology of a new series of quinoline derivatives acting as selective, noncompetitive mGlu1 antagonists. J Med Chem 48:2134-53 (2005)  
Target
Name:
Metabotropic glutamate receptor 1
Synonyms:
GPRC1A GRM1_HUMAN Metabotropic Glutamate 1a | metabotropic glutamate 1
Type:
Enzyme
Mol. Mass.:
132358.19
Organism:
Homo sapiens (Human)
Description:
Q13255
Residue:
1194
  
Inhibitor
Name:
BDBM50163600
Synonyms:
(3-Ethyl-2-methyl-quinolin-6-yl)-(4-hydroxy-cyclohexyl)-methanone | CHEMBL177585
Type:
Small organic molecule
Emp. Form.:
C19H23NO2
Mol. Mass.:
297.3914
SMILES:
CCc1cc2cc(ccc2nc1C)C(=O)C1CCC(O)CC1
: