Target
Metabotropic glutamate receptor 1
Ligand
BDBM50163598
Substrate
Meas. Tech.
ChEMBL_305830 (CHEMBL829572)
IC50
16±n/a nM
Citation
 Mabire, DCoupa, SAdelinet, CPoncelet, ASimonnet, YVenet, MWouters, RLesage, ASVan Beijsterveldt, LBischoff, F Synthesis, structure-activity relationship, and receptor pharmacology of a new series of quinoline derivatives acting as selective, noncompetitive mGlu1 antagonists. J Med Chem 48:2134-53 (2005)  
Target
Name:
Metabotropic glutamate receptor 1
Synonyms:
GRM1_RAT Grm1 Metabotropic glutamate receptor Mglur1 metabotropic glutamate 1/5-D metabotropic glutamate receptor 1 isoform alpha precursor
Type:
Enzyme Catalytic Domain
Mol. Mass.:
133240.47
Organism:
RAT
Description:
metabotropic glutamate 1/2 0 RAT::P23385
Residue:
1199
  
Inhibitor
Name:
BDBM50163598
Synonyms:
1-(3-Ethyl-2-methyl-quinolin-6-yl)-2-(4-methoxy-cyclohexyl)-ethanone | CHEMBL175699
Type:
Small organic molecule
Emp. Form.:
C21H27NO2
Mol. Mass.:
325.4446
SMILES:
CCc1cc2cc(ccc2nc1C)C(=O)C[C@H]1CC[C@H](CC1)OC
: