Target
Metabotropic glutamate receptor 1
Ligand
BDBM50163611
Substrate
Meas. Tech.
ChEMBL_305830 (CHEMBL829572)
IC50
7±n/a nM
Citation
 Mabire, DCoupa, SAdelinet, CPoncelet, ASimonnet, YVenet, MWouters, RLesage, ASVan Beijsterveldt, LBischoff, F Synthesis, structure-activity relationship, and receptor pharmacology of a new series of quinoline derivatives acting as selective, noncompetitive mGlu1 antagonists. J Med Chem 48:2134-53 (2005)  
Target
Name:
Metabotropic glutamate receptor 1
Synonyms:
GRM1_RAT Grm1 Metabotropic glutamate receptor Mglur1 metabotropic glutamate 1/5-D metabotropic glutamate receptor 1 isoform alpha precursor
Type:
Enzyme Catalytic Domain
Mol. Mass.:
133240.47
Organism:
RAT
Description:
metabotropic glutamate 1/2 0 RAT::P23385
Residue:
1199
  
Inhibitor
Name:
BDBM50163611
Synonyms:
1-(3,4-Dihydro-2H-1-oxa-9-aza-anthracen-6-yl)-2-thiophen-3-yl-ethanone | CHEMBL178742
Type:
Small organic molecule
Emp. Form.:
C18H15NO2S
Mol. Mass.:
309.382
SMILES:
O=C(Cc1ccsc1)c1ccc2nc3OCCCc3cc2c1
: