Target
Metabotropic glutamate receptor 1
Ligand
BDBM50163615
Substrate
Meas. Tech.
ChEMBL_305830 (CHEMBL829572)
IC50
8±n/a nM
Citation
 Mabire, DCoupa, SAdelinet, CPoncelet, ASimonnet, YVenet, MWouters, RLesage, ASVan Beijsterveldt, LBischoff, F Synthesis, structure-activity relationship, and receptor pharmacology of a new series of quinoline derivatives acting as selective, noncompetitive mGlu1 antagonists. J Med Chem 48:2134-53 (2005)  
Target
Name:
Metabotropic glutamate receptor 1
Synonyms:
GRM1_RAT Grm1 Metabotropic glutamate receptor Mglur1 metabotropic glutamate 1/5-D metabotropic glutamate receptor 1 isoform alpha precursor
Type:
Enzyme Catalytic Domain
Mol. Mass.:
133240.47
Organism:
RAT
Description:
metabotropic glutamate 1/2 0 RAT::P23385
Residue:
1199
  
Inhibitor
Name:
BDBM50163615
Synonyms:
(4-Methoxy-cyclohexyl)-(1-methyl-1,2,3,4-tetrahydro-benzo[b][1,8]naphthyridin-7-yl)-methanone | CHEMBL174216
Type:
Small organic molecule
Emp. Form.:
C21H26N2O2
Mol. Mass.:
338.4433
SMILES:
CO[C@H]1CC[C@H](CC1)C(=O)c1ccc2nc3N(C)CCCc3cc2c1
: