Target
Metabotropic glutamate receptor 1
Ligand
BDBM50163615
Substrate
Meas. Tech.
ChEMBL_305883 (CHEMBL874546)
IC50
29±n/a nM
Citation
 Mabire, DCoupa, SAdelinet, CPoncelet, ASimonnet, YVenet, MWouters, RLesage, ASVan Beijsterveldt, LBischoff, F Synthesis, structure-activity relationship, and receptor pharmacology of a new series of quinoline derivatives acting as selective, noncompetitive mGlu1 antagonists. J Med Chem 48:2134-53 (2005)  
Target
Name:
Metabotropic glutamate receptor 1
Synonyms:
GPRC1A GRM1_HUMAN Metabotropic Glutamate 1a | metabotropic glutamate 1
Type:
Enzyme
Mol. Mass.:
132358.19
Organism:
Homo sapiens (Human)
Description:
Q13255
Residue:
1194
  
Inhibitor
Name:
BDBM50163615
Synonyms:
(4-Methoxy-cyclohexyl)-(1-methyl-1,2,3,4-tetrahydro-benzo[b][1,8]naphthyridin-7-yl)-methanone | CHEMBL174216
Type:
Small organic molecule
Emp. Form.:
C21H26N2O2
Mol. Mass.:
338.4433
SMILES:
CO[C@H]1CC[C@H](CC1)C(=O)c1ccc2nc3N(C)CCCc3cc2c1
: