Target
Ileal sodium/bile acid cotransporter
Ligand
BDBM50172608
Substrate
Meas. Tech.
ChEMBL_321554 (CHEMBL881968)
IC50
2±n/a nM
Citation
 Tremont, SJLee, LFHuang, HCKeller, BTBanerjee, SCBoth, SRCarpenter, AJWang, CCGarland, DJHuang, WJones, CKoeller, KJKolodziej, SALi, JManning, REMahoney, MWMiller, REMischke, DARath, NPFletcher, TReinhard, EJTollefson, MBVernier, WFWagner, GMRapp, SRBeaudry, JGlenn, KRegina, KSchuh, JRSmith, METrivedi, JSReitz, DB Discovery of potent, nonsystemic apical sodium-codependent bile acid transporter inhibitors (Part 1). J Med Chem 48:5837-52 (2005)  
Target
Name:
Ileal sodium/bile acid cotransporter
Synonyms:
ASBT IBAT Ileal Na(+)/bile acid cotransporter Ileal bile acid transporter/bile acid cotransporter NTCP2 SLC10A2
Type:
Enzyme
Mol. Mass.:
37714.89
Organism:
Homo sapiens (Human)
Description:
SLC10A2
Residue:
348
  
Inhibitor
Name:
BDBM50172608
Synonyms:
(4R,5R)-3,3-Dibutyl-7-dimethylamino-9-methoxy-5-(4-methoxy-phenyl)-1,1-dioxo-2,3,4,5-tetrahydro-1H-1lambda*6*-benzo[b]thiepin-4-ol | CHEMBL372275
Type:
Small organic molecule
Emp. Form.:
C28H41NO5S
Mol. Mass.:
503.694
SMILES:
CCCCC1(CCCC)CS(=O)(=O)c2c(OC)cc(cc2[C@H]([C@H]1O)c1ccc(OC)cc1)N(C)C
: