Target
Ileal sodium/bile acid cotransporter
Ligand
BDBM50370665
Substrate
Meas. Tech.
ChEMBL_321562 (CHEMBL882493)
IC50
3±n/a nM
Citation
 Huang, HCTremont, SJLee, LFKeller, BTCarpenter, AJWang, CCBanerjee, SCBoth, SRFletcher, TGarland, DJHuang, WJones, CKoeller, KJKolodziej, SALi, JManning, REMahoney, MWMiller, REMischke, DARath, NPReinhard, EJTollefson, MBVernier, WFWagner, GMRapp, SRBeaudry, JGlenn, KRegina, KSchuh, JRSmith, METrivedi, JSReitz, DB Discovery of potent, nonsystemic apical sodium-codependent bile acid transporter inhibitors (Part 2). J Med Chem 48:5853-68 (2005)  
Target
Name:
Ileal sodium/bile acid cotransporter
Synonyms:
ASBT IBAT Ileal Na(+)/bile acid cotransporter Ileal bile acid transporter/bile acid cotransporter NTCP2 SLC10A2
Type:
Enzyme
Mol. Mass.:
37714.89
Organism:
Homo sapiens (Human)
Description:
SLC10A2
Residue:
348
  
Inhibitor
Name:
BDBM50370665
Synonyms:
CHEMBL555024
Type:
Small organic molecule
Emp. Form.:
C38H63N2O6S
Mol. Mass.:
675.981
SMILES:
CCCCC1(CCCC)CS(=O)(=O)c2ccc(cc2[C@H]([C@H]1O)c1ccc(OCCOCCOCC[N+](CC)(CC)CC)cc1)N(C)C
: