Target
Glutamine synthetase
Ligand
BDBM50174526
Substrate
Meas. Tech.
ChEMBL_320773 (CHEMBL884728)
Ki
2100±n/a nM
Citation
 Berlicki, LObojska, AForlani, GKafarski, P Design, synthesis, and activity of analogues of phosphinothricin as inhibitors of glutamine synthetase. J Med Chem 48:6340-9 (2005)  
Target
Name:
Glutamine synthetase
Synonyms:
GLN1B_ECOLI | glnA
Type:
PROTEIN
Mol. Mass.:
51891.08
Organism:
Escherichia coli (strain K12)
Description:
ChEMBL_321474
Residue:
469
  
Inhibitor
Name:
BDBM50174526
Synonyms:
(S)-2-Amino-4-(hydroxy-hydroxymethyl-phosphinoyl)-butyric acid; hydrochloride | CHEMBL535377
Type:
Small organic molecule
Emp. Form.:
C5H12NO5P
Mol. Mass.:
197.1262
SMILES:
N[C@@H](CCP(O)(O)C=O)C(O)=O
: