Target
Sterol O-acyltransferase 1
Ligand
BDBM50175768
Substrate
Meas. Tech.
ChEMBL_328123 (CHEMBL863930)
IC50
427±n/a nM
Citation
 Ban, HMuraoka, MIoriya, KOhashi, N Synthesis and biological activity of novel 4-phenyl-1,8-naphthyridin-2(1H)-on-3-yl ureas: potent acyl-CoA:cholesterol acyltransferase inhibitor with improved aqueous solubility. Bioorg Med Chem Lett 16:44-8 (2005)  
Target
Name:
Sterol O-acyltransferase 1
Synonyms:
ACAT-1 Acat SOAT1_RAT Sterol O-acyltransferase, Soat
Type:
PROTEIN
Mol. Mass.:
64165.56
Organism:
Rattus norvegicus
Description:
ChEMBL_28796
Residue:
545
  
Inhibitor
Name:
BDBM50175768
Synonyms:
1-(4-amino-2,6-diisopropylphenyl)-3-(1-butyl-2-oxo-4-(3-(3-(pyrrolidin-1-yl)propoxy)phenyl)-1,2-dihydro-1,8-naphthyridin-3-yl)urea dihydrochloride | CHEMBL537859
Type:
Small organic molecule
Emp. Form.:
C38H50N6O3
Mol. Mass.:
638.842
SMILES:
CCCCn1c2ncccc2c(-c2cccc(OCCCN3CCCC3)c2)c(NC(=O)Nc2c(cc(N)cc2C(C)C)C(C)C)c1=O
: