Target
5-hydroxytryptamine receptor 1A
Ligand
BDBM50182571
Substrate
Meas. Tech.
ChEMBL_334930 (CHEMBL859245)
IC50
>10000±n/a nM
Citation
 Meltzer, PCButler, DDeschamps, JRMadras, BK 1-(4-Methylphenyl)-2-pyrrolidin-1-yl-pentan-1-one (Pyrovalerone) analogues: a promising class of monoamine uptake inhibitors. J Med Chem 49:1420-32 (2006)  
Target
Name:
5-hydroxytryptamine receptor 1A
Synonyms:
5-HT-1A 5-hydroxytryptamine receptor 1A (5-HT-1A) ADRB2RL1 Dopamine D2 receptor and serotonin 1a receptor HTR1A | Serotonin receptor 1A
Type:
Mol. Mass.:
46122.49
Organism:
Homo sapiens (Human)
Description:
Residue:
422
  
Inhibitor
Name:
BDBM50182571
Synonyms:
2-pyrrolidin-1-yl-1-(4-thiophen-2-yl-phenyl)pentan-1-one | CHEMBL369997
Type:
Small organic molecule
Emp. Form.:
C19H23NOS
Mol. Mass.:
313.457
SMILES:
CCCC(N1CCCC1)C(=O)c1ccc(cc1)-c1cccs1
: