Target
Sodium-dependent serotonin transporter
Ligand
BDBM50182571
Substrate
Meas. Tech.
ChEMBL_334926 (CHEMBL859238)
Ki
3320±n/a nM
Citation
 Meltzer, PCButler, DDeschamps, JRMadras, BK 1-(4-Methylphenyl)-2-pyrrolidin-1-yl-pentan-1-one (Pyrovalerone) analogues: a promising class of monoamine uptake inhibitors. J Med Chem 49:1420-32 (2006)  
Target
Name:
Sodium-dependent serotonin transporter
Synonyms:
5-HT Transporter 5HTT SC6A4_HUMAN SLC6A4 Serotonin transporter (5HTT) Sodium-dependent serotonin transporter (SERT) | Solute carrier family 6 member 4
Type:
Multi-pass membrane protein
Mol. Mass.:
70322.51
Organism:
Homo sapiens (Human)
Description:
P31645
Residue:
630
  
Inhibitor
Name:
BDBM50182571
Synonyms:
2-pyrrolidin-1-yl-1-(4-thiophen-2-yl-phenyl)pentan-1-one | CHEMBL369997
Type:
Small organic molecule
Emp. Form.:
C19H23NOS
Mol. Mass.:
313.457
SMILES:
CCCC(N1CCCC1)C(=O)c1ccc(cc1)-c1cccs1
: