Target
D(2) dopamine receptor
Ligand
BDBM50182571
Substrate
Meas. Tech.
ChEMBL_334934 (CHEMBL859254)
IC50
>10000±n/a nM
Citation
 Meltzer, PCButler, DDeschamps, JRMadras, BK 1-(4-Methylphenyl)-2-pyrrolidin-1-yl-pentan-1-one (Pyrovalerone) analogues: a promising class of monoamine uptake inhibitors. J Med Chem 49:1420-32 (2006)  
Target
Name:
D(2) dopamine receptor
Synonyms:
D(2) dopamine receptor DOPAMINE D2 Long DRD2 Dopamine D2 receptor Dopamine D2 receptor (D2R) Dopamine2-like | d2
Type:
Cell-surface receptors
Mol. Mass.:
50647.10
Organism:
Homo sapiens (Human)
Description:
P14416
Residue:
443
  
Inhibitor
Name:
BDBM50182571
Synonyms:
2-pyrrolidin-1-yl-1-(4-thiophen-2-yl-phenyl)pentan-1-one | CHEMBL369997
Type:
Small organic molecule
Emp. Form.:
C19H23NOS
Mol. Mass.:
313.457
SMILES:
CCCC(N1CCCC1)C(=O)c1ccc(cc1)-c1cccs1
: