Target
Sodium-dependent dopamine transporter
Ligand
BDBM50182571
Substrate
Meas. Tech.
ChEMBL_334924 (CHEMBL859233)
Ki
460±n/a nM
Citation
 Meltzer, PCButler, DDeschamps, JRMadras, BK 1-(4-Methylphenyl)-2-pyrrolidin-1-yl-pentan-1-one (Pyrovalerone) analogues: a promising class of monoamine uptake inhibitors. J Med Chem 49:1420-32 (2006)  
Target
Name:
Sodium-dependent dopamine transporter
Synonyms:
DA transporter DAT1 Dopamine transporter protein (DAT) SC6A3_HUMAN Sodium-dependent dopamine transporter Solute carrier family 6 member 3
Type:
Multi-pass membrane protein
Mol. Mass.:
68497.11
Organism:
Homo sapiens (Human)
Description:
Q01959
Residue:
620
  
Inhibitor
Name:
BDBM50182571
Synonyms:
2-pyrrolidin-1-yl-1-(4-thiophen-2-yl-phenyl)pentan-1-one | CHEMBL369997
Type:
Small organic molecule
Emp. Form.:
C19H23NOS
Mol. Mass.:
313.457
SMILES:
CCCC(N1CCCC1)C(=O)c1ccc(cc1)-c1cccs1
: