Target
Sodium-dependent noradrenaline transporter
Ligand
BDBM50182571
Substrate
Meas. Tech.
ChEMBL_334929 (CHEMBL859244)
IC50
263±n/a nM
Citation
 Meltzer, PCButler, DDeschamps, JRMadras, BK 1-(4-Methylphenyl)-2-pyrrolidin-1-yl-pentan-1-one (Pyrovalerone) analogues: a promising class of monoamine uptake inhibitors. J Med Chem 49:1420-32 (2006)  
Target
Name:
Sodium-dependent noradrenaline transporter
Synonyms:
Monoamine transporter NET Noradrenaline Transporter (NET) Norepinephrine transporter protein (NET) SLC6A2 Sodium-dependent noradrenaline transporter (NET) | Solute carrier family 6 member 2
Type:
Multi-pass membrane protein
Mol. Mass.:
69337.72
Organism:
Homo sapiens (Human)
Description:
P23975
Residue:
617
  
Inhibitor
Name:
BDBM50182571
Synonyms:
2-pyrrolidin-1-yl-1-(4-thiophen-2-yl-phenyl)pentan-1-one | CHEMBL369997
Type:
Small organic molecule
Emp. Form.:
C19H23NOS
Mol. Mass.:
313.457
SMILES:
CCCC(N1CCCC1)C(=O)c1ccc(cc1)-c1cccs1
: