Target
Adenosine receptor A3
Ligand
BDBM50185938
Substrate
Meas. Tech.
ChEMBL_351396 (CHEMBL870047)
Ki
200±n/a nM
Citation
 Gao, ZGDuong, HTSonina, TKim, SKVan Rompaey, PVan Calenbergh, SMamedova, LKim, HOKim, MJKim, AYLiang, BTJeong, LSJacobson, KA Orthogonal activation of the reengineered A3 adenosine receptor (neoceptor) using tailored nucleoside agonists. J Med Chem 49:2689-702 (2006)  
Target
Name:
Adenosine receptor A3
Synonyms:
A3 adenosine receptor (hA3) ADORA3 | Adenosine A3 receptor (A3AR)
Type:
G Protein-Coupled Receptor (GPCR)
Mol. Mass.:
36197.32
Organism:
Homo sapiens (Human)
Description:
P0DMS8
Residue:
318
  
Inhibitor
Name:
BDBM50185938
Synonyms:
CHEMBL377490 | {5-[2-chloro-6-(3-iodo-benzylamino)-purin-9-yl]-4-hydroxy-2-hydroxymethyl-tetrahydro-furan-3-yl}urea
Type:
Small organic molecule
Emp. Form.:
C18H19ClIN7O4
Mol. Mass.:
559.745
SMILES:
NC(=O)N[C@@H]1[C@@H](CO)O[C@H]([C@@H]1O)n1cnc2c(NCc3cccc(I)c3)nc(Cl)nc12
: