Target
Solute carrier family 15 member 1
Ligand
BDBM50038066
Substrate
Meas. Tech.
ChEMBL_363882 (CHEMBL863213)
IC50
100000±n/a nM
Citation
 Vig, BSStouch, TRTimoszyk, JKQuan, YWall, DASmith, RLFaria, TN Human PEPT1 pharmacophore distinguishes between dipeptide transport and binding. J Med Chem 49:3636-44 (2006)  
Target
Name:
Solute carrier family 15 member 1
Synonyms:
Intestinal H(+)/peptide cotransporter Oligopeptide transporter, small intestine isoform Peptide transporter 1 SLC15A1
Type:
PROTEIN
Mol. Mass.:
78818.07
Organism:
Homo sapiens (Human)
Description:
ChEMBL_1488839
Residue:
708
  
Inhibitor
Name:
BDBM50038066
Synonyms:
(S)-2-((S)-2-Amino-3-methyl-butyrylamino)-3-(1H-indol-3-yl)-propionic acid CHEMBL91777 | Val-Trp
Type:
Small organic molecule
Emp. Form.:
C16H21N3O3
Mol. Mass.:
303.3562
SMILES:
CC(C)[C@H](N)C(=O)N[C@@H](Cc1c[nH]c2ccccc12)C(O)=O
: