Target
Solute carrier family 15 member 1
Ligand
BDBM50188504
Substrate
Meas. Tech.
ChEMBL_363882 (CHEMBL863213)
IC50
450000±n/a nM
Citation
 Vig, BSStouch, TRTimoszyk, JKQuan, YWall, DASmith, RLFaria, TN Human PEPT1 pharmacophore distinguishes between dipeptide transport and binding. J Med Chem 49:3636-44 (2006)  
Target
Name:
Solute carrier family 15 member 1
Synonyms:
Intestinal H(+)/peptide cotransporter Oligopeptide transporter, small intestine isoform Peptide transporter 1 SLC15A1
Type:
PROTEIN
Mol. Mass.:
78818.07
Organism:
Homo sapiens (Human)
Description:
ChEMBL_1488839
Residue:
708
  
Inhibitor
Name:
BDBM50188504
Synonyms:
Ala-Asp | CHEMBL380047
Type:
Small organic molecule
Emp. Form.:
C7H12N2O5
Mol. Mass.:
204.1806
SMILES:
C[C@H](N)C(=O)N[C@@H](CC(O)=O)C(O)=O
: