Target
Solute carrier family 15 member 1
Ligand
BDBM50169141
Substrate
Meas. Tech.
ChEMBL_363882 (CHEMBL863213)
IC50
800000±n/a nM
Citation
 Vig, BSStouch, TRTimoszyk, JKQuan, YWall, DASmith, RLFaria, TN Human PEPT1 pharmacophore distinguishes between dipeptide transport and binding. J Med Chem 49:3636-44 (2006)  
Target
Name:
Solute carrier family 15 member 1
Synonyms:
Intestinal H(+)/peptide cotransporter Oligopeptide transporter, small intestine isoform Peptide transporter 1 SLC15A1
Type:
PROTEIN
Mol. Mass.:
78818.07
Organism:
Homo sapiens (Human)
Description:
ChEMBL_1488839
Residue:
708
  
Inhibitor
Name:
BDBM50169141
Synonyms:
CHEMBL371194 i(S)-1-((S)-Pyrrolidine-2-carbonyl)-pyrroliidine-2-carboxylic acid
Type:
Small organic molecule
Emp. Form.:
C10H16N2O3
Mol. Mass.:
212.2456
SMILES:
OC(=O)[C@@H]1CCCN1C(=O)[C@@H]1CCCN1
: