Target
Solute carrier family 15 member 1
Ligand
BDBM50188499
Substrate
Meas. Tech.
ChEMBL_363882 (CHEMBL863213)
IC50
520000±n/a nM
Citation
 Vig, BSStouch, TRTimoszyk, JKQuan, YWall, DASmith, RLFaria, TN Human PEPT1 pharmacophore distinguishes between dipeptide transport and binding. J Med Chem 49:3636-44 (2006)  
Target
Name:
Solute carrier family 15 member 1
Synonyms:
Intestinal H(+)/peptide cotransporter Oligopeptide transporter, small intestine isoform Peptide transporter 1 SLC15A1
Type:
PROTEIN
Mol. Mass.:
78818.07
Organism:
Homo sapiens (Human)
Description:
ChEMBL_1488839
Residue:
708
  
Inhibitor
Name:
BDBM50188499
Synonyms:
(S)-2-(2-Amino-acetylamino)-3-(1H-indol-3-yl)-propionic acid 2-(2-Amino-acetylamino)-3-(1H-indol-3-yl)-propionic acid Gly-Trp
Type:
Small organic molecule
Emp. Form.:
C13H15N3O3
Mol. Mass.:
261.2765
SMILES:
NCC(=O)N[C@@H](Cc1c[nH]c2ccccc12)C(O)=O
: