Target
Solute carrier family 15 member 1
Ligand
BDBM50188528
Substrate
Meas. Tech.
ChEMBL_363882 (CHEMBL863213)
IC50
150000±n/a nM
Citation
 Vig, BSStouch, TRTimoszyk, JKQuan, YWall, DASmith, RLFaria, TN Human PEPT1 pharmacophore distinguishes between dipeptide transport and binding. J Med Chem 49:3636-44 (2006)  
Target
Name:
Solute carrier family 15 member 1
Synonyms:
Intestinal H(+)/peptide cotransporter Oligopeptide transporter, small intestine isoform Peptide transporter 1 SLC15A1
Type:
PROTEIN
Mol. Mass.:
78818.07
Organism:
Homo sapiens (Human)
Description:
ChEMBL_1488839
Residue:
708
  
Inhibitor
Name:
BDBM50188528
Synonyms:
CHEMBL438960 | Gln-Gln
Type:
Small organic molecule
Emp. Form.:
C10H18N4O5
Mol. Mass.:
274.2737
SMILES:
N[C@@H](CCC(N)=O)C(=O)N[C@@H](CCC(N)=O)C(O)=O
: