Target
Solute carrier family 15 member 1
Ligand
BDBM50188508
Substrate
Meas. Tech.
ChEMBL_363882 (CHEMBL863213)
IC50
120000±n/a nM
Citation
 Vig, BSStouch, TRTimoszyk, JKQuan, YWall, DASmith, RLFaria, TN Human PEPT1 pharmacophore distinguishes between dipeptide transport and binding. J Med Chem 49:3636-44 (2006)  
Target
Name:
Solute carrier family 15 member 1
Synonyms:
Intestinal H(+)/peptide cotransporter Oligopeptide transporter, small intestine isoform Peptide transporter 1 SLC15A1
Type:
PROTEIN
Mol. Mass.:
78818.07
Organism:
Homo sapiens (Human)
Description:
ChEMBL_1488839
Residue:
708
  
Inhibitor
Name:
BDBM50188508
Synonyms:
(S)-2-(2-Amino-acetylamino)-3-(4-hydroxy-phenyl)-propionic acid CHEMBL53400 | Gly-Tyr
Type:
Small organic molecule
Emp. Form.:
C11H14N2O4
Mol. Mass.:
238.2399
SMILES:
NCC(=O)N[C@@H](Cc1ccc(O)cc1)C(O)=O
: