Target
Solute carrier family 15 member 1
Ligand
BDBM50188531
Substrate
Meas. Tech.
ChEMBL_363882 (CHEMBL863213)
IC50
250000±n/a nM
Citation
 Vig, BSStouch, TRTimoszyk, JKQuan, YWall, DASmith, RLFaria, TN Human PEPT1 pharmacophore distinguishes between dipeptide transport and binding. J Med Chem 49:3636-44 (2006)  
Target
Name:
Solute carrier family 15 member 1
Synonyms:
Intestinal H(+)/peptide cotransporter Oligopeptide transporter, small intestine isoform Peptide transporter 1 SLC15A1
Type:
PROTEIN
Mol. Mass.:
78818.07
Organism:
Homo sapiens (Human)
Description:
ChEMBL_1488839
Residue:
708
  
Inhibitor
Name:
BDBM50188531
Synonyms:
CHEMBL208094 | Lys-Val
Type:
Small organic molecule
Emp. Form.:
C11H23N3O3
Mol. Mass.:
245.3186
SMILES:
CC(C)[C@H](NC(=O)[C@@H](N)CCCCN)C(O)=O
: