Target
Delta-type opioid receptor
Ligand
BDBM50189247
Substrate
Meas. Tech.
ChEMBL_378703 (CHEMBL853451)
Ki
18±n/a nM
Citation
 Crooks, PAKottayil, SGAl-Ghananeem, AMByrn, SRButterfield, DA Opiate receptor binding properties of morphine-, dihydromorphine-, and codeine 6-O-sulfate ester congeners. Bioorg Med Chem Lett 16:4291-5 (2006)  
Target
Name:
Delta-type opioid receptor
Synonyms:
D-OR-1 Delta opioid receptor OPIATE Delta OPRD1 OPRK1 | opioid receptor, delta 1
Type:
G Protein-Coupled Receptor (GPCR)
Mol. Mass.:
40382.98
Organism:
Homo sapiens (Human)
Description:
Competition binding assays were carried out using membrane preparations from transfected HN9.10 cells that constitutively expressed the delta opioid receptor.
Residue:
372
  
Inhibitor
Name:
BDBM50189247
Synonyms:
CHEMBL1418 | M6S
Type:
Small organic molecule
Emp. Form.:
C17H19NO6S
Mol. Mass.:
365.401
SMILES:
C[NH+]1CC[C@@]23[C@H]4Oc5c2c(C[C@@H]1[C@@H]3C=C[C@@H]4OS([O-])(=O)=O)ccc5O
: